9159金沙游艺场


JavaScript 深入之执行上下文
图片 1
异常处理

老师讲课博客目录

    
 Django基础(一)

对Python的Django框架中的项目进行单元测试的方法,pythondjango

 Python中的单元测试

我们先来回顾一下Python中的单元测试方法。
下面是一个 Python的单元测试简单的例子:

假如我们开发一个除法的功能,有的同学可能觉得很简单,代码是这样的:

def division_funtion(x, y):
  return x / y

但是这样写究竟对还是不对呢,有些同学可以在代码下面这样测试:

def division_funtion(x, y):
  return x / y


if __name__ == '__main__':
  print division_funtion(2, 1)
  print division_funtion(2, 4)
  print division_funtion(8, 3)

但是这样运行后得到的结果,自己每次都得算一下去核对一遍,很不方便,Python中有
unittest
模块,可以很方便地进行测试,详情可以文章最后的链接,看官网文档的详细介绍。

下面是一个简单的示例:

import unittest


def division_funtion(x, y):
  return x / y


class TestDivision(unittest.TestCase):
  def test_int(self):
    self.assertEqual(division_funtion(9, 3), 3)

  def test_int2(self):
    self.assertEqual(division_funtion(9, 4), 2.25)

  def test_float(self):
    self.assertEqual(division_funtion(4.2, 3), 1.4)


if __name__ == '__main__':
  unittest.main()

我简单地写了三个测试示例(不一定全面,只是示范,比如没有考虑除数是0的情况),运行后发现:

F.F
======================================================================
FAIL: test_float (__main__.TestDivision)
----------------------------------------------------------------------
Traceback (most recent call last):
 File "/Users/tu/YunPan/mydivision.py", line 16, in test_float
  self.assertEqual(division_funtion(4.2, 3), 1.4)
AssertionError: 1.4000000000000001 != 1.4

======================================================================
FAIL: test_int2 (__main__.TestDivision)
----------------------------------------------------------------------
Traceback (most recent call last):
 File "/Users/tu/YunPan/1.py", line 13, in test_int2
  self.assertEqual(division_funtion(9, 4), 2.25)
AssertionError: 2 != 2.25

----------------------------------------------------------------------
Ran 3 tests in 0.001s

FAILED (failures=2)

汗!发现了没,竟然两个都失败了,测试发现:

4.2除以3 等于 1.4000000000000001 不等于期望值 1.4

9除以4等于2,不等于期望的 2.25

下面我们就是要修复这些问题,再次运行测试,直到运行不报错为止。

譬如根据实际情况,假设我们只需要保留到小数点后6位,可以这样改:

def division_funtion(x, y):
  return round(float(x) / y, 6)

再次运行就不报错了:

...
----------------------------------------------------------------------
Ran 3 tests in 0.000s

 
OK

Django中的单元测试

尽早进行单元测试(UnitTest)是比较好的做法,极端的情况甚至强调“测试先行”。现在我们已经有了第一个model类和Form类,是时候开始写测试代码了。

Django支持python的单元测试(unit test)和文本测试(doc
test),我们这里主要讨论单元测试的方式。这里不对单元测试的理论做过多的阐述,假设你已经熟悉了下列概念:test
suite, test case, test/test action,  test data, assert等等。

在单元测试方面,Django继承python的unittest.TestCase实现了自己的django.test.TestCase,编写测试用
例通常从这里开始。测试代码通常位于app的tests.py文件中(也可以在models.py中编写,但是我不建议这样做)。在Django生成的
depotapp中,已经包含了这个文件,并且其中包含了一个测试用例的样例:

depot/depotapp/tests.py

from django.test import TestCase
class SimpleTest(TestCase):
def test_basic_addition(self):
"""
Tests that 1 + 1 always equals 2.
"""
self.assertEqual(1 + 1, 2)

你可以有几种方式运行单元测试:

  • python manage.py test:执行所有的测试用例
  • python manage.py test app_name, 执行该app的所有测试用例
  • python manage.py test app_name.case_name: 执行指定的测试用例

用第三种方式执行上面提供的样例,结果如下:

$ python manage.py test depotapp.SimpleTest

Creating test database for alias 'default'...
.
----------------------------------------------------------------------
Ran 1 test in 0.012s

OK
Destroying test database for alias 'default'...

你可能会主要到,输出信息中包括了创建和删除数据库的操作。为了避免测试数据造成的影响,测试过程会使用一个单独的数据库,关于如何指定测试数据库
的细节,请查阅Django文档。在我们的例子中,由于使用sqlite数据库,Django将默认采用内存数据库来进行测试。

下面就让我们来编写测试用例。在《Agile Web Development with Rails
4th》中,7.2节,最终实现的ProductTest代码如下:

class ProductTest < ActiveSupport::TestCase
test "product attributes must not be empty"do
product = Product.new
assert product.invalid?
assert product.errors[:title].any?
assert product.errors[:description].any?
assert product.errors[:price].any?
assert product.errors[:image_url].any?
end
test "product price must be positive"do
product = Product.new(:title => "My Book Title",
:description => "yyy",
:image_url => "zzz.jpg")
product.price = -1
assert product.invalid?
assert_equal "must be greater than or equal to 0.01",
product.errors[:price].join('; ')
product.price = 0
assert product.invalid?
assert_equal "must be greater than or equal to 0.01",
product.errors[:price].join('; ')
product.price = 1
assert product.valid?
end
def new_product(image_url)
Product.new(:title => "My Book Title",
:description => "yyy",
:price => 1,
:image_url => image_url)
end
test "image url"do
ok = %w{ fred.gif fred.jpg fred.png FRED.JPG FRED.Jpg
http://a.b.c/x/y/z/fred.gif }
bad = %w{ fred.doc fred.gif/more fred.gif.more }
ok.eachdo |name|
assert new_product(name).valid?, "#{name} shouldn't be invalid"
end
bad.eachdo |name|
assert new_product(name).invalid?, "#{name} shouldn't be valid"
end
end
test "product is not valid without a unique title"do
product = Product.new(:title => products(:ruby).title,
:description => "yyy",
:price => 1,
:image_url => "fred.gif")
assert !product.save
assert_equal "has already been taken", product.errors[:title].join('; ')
end
test "product is not valid without a unique title - i18n"do
product = Product.new(:title => products(:ruby).title,
:description => "yyy",
:price => 1,
:image_url => "fred.gif")
assert !product.save
assert_equal I18n.translate('activerecord.errors.messages.taken'),
product.errors[:title].join('; ')
end
end

对Product测试的内容包括:

1.title,description,price,image_url不能为空;

  1. price必须大于零;

  2. image_url必须以jpg,png,jpg结尾,并且对大小写不敏感;

  3. titile必须唯一;

让我们在Django中进行这些测试。由于ProductForm包含了模型校验和表单校验规则,使用ProductForm可以很容易的实现上述测试:

depot/depotapp/tests.py

#/usr/bin/python
#coding: utf8
"""
This file demonstrates writing tests using the unittest module. These will pass
when you run "manage.py test".
Replace this with more appropriate tests for your application.
"""
from django.test import TestCase
from forms import ProductForm
class SimpleTest(TestCase):
def test_basic_addition(self):
"""
Tests that 1 + 1 always equals 2.
"""
self.assertEqual(1 + 1, 2)
class ProductTest(TestCase):
def setUp(self):
self.product = {
'title':'My Book Title',
'description':'yyy',
'image_url':'http://google.com/logo.png',
'price':1
}
f = ProductForm(self.product)
f.save()
self.product['title'] = 'My Another Book Title'
#### title,description,price,image_url不能为空
def test_attrs_cannot_empty(self):
f = ProductForm({})
self.assertFalse(f.is_valid())
self.assertTrue(f['title'].errors)
self.assertTrue(f['description'].errors)
self.assertTrue(f['price'].errors)
self.assertTrue(f['image_url'].errors)
####  price必须大于零
def test_price_positive(self):
f = ProductForm(self.product)
self.assertTrue(f.is_valid())
self.product['price'] = 0
f = ProductForm(self.product)
self.assertFalse(f.is_valid())
self.product['price'] = -1
f = ProductForm(self.product)
self.assertFalse(f.is_valid())
self.product['price'] = 1
####  image_url必须以jpg,png,jpg结尾,并且对大小写不敏感;
def test_imgae_url_endwiths(self):
url_base = 'http://google.com/'
oks = ('fred.gif', 'fred.jpg', 'fred.png', 'FRED.JPG', 'FRED.Jpg')
bads = ('fred.doc', 'fred.gif/more', 'fred.gif.more')
for endwith in oks:
self.product['image_url'] = url_base+endwith
f = ProductForm(self.product)
self.assertTrue(f.is_valid(),msg='error when image_url endwith '+endwith)
for endwith in bads:
self.product['image_url'] = url_base+endwith
f = ProductForm(self.product)
self.assertFalse(f.is_valid(),msg='error when image_url endwith '+endwith)
self.product['image_url'] = 'http://google.com/logo.png'
###  titile必须唯一
def test_title_unique(self):
self.product['title'] = 'My Book Title'
f = ProductForm(self.product)
self.assertFalse(f.is_valid())
self.product['title'] = 'My Another Book Title'

然后运行 python manage.py test
depotapp.ProductTest。如同预想的那样,测试没有通过:

Creating test database for alias 'default'...
.F..
======================================================================
FAIL: test_imgae_url_endwiths (depot.depotapp.tests.ProductTest)
----------------------------------------------------------------------
Traceback (most recent call last):
File "/Users/holbrook/Documents/Dropbox/depot/../depot/depotapp/tests.py", line 65, in test_imgae_url_endwiths
self.assertTrue(f.is_valid(),msg='error when image_url endwith '+endwith)
AssertionError: False is not True : error when image_url endwith FRED.JPG

----------------------------------------------------------------------
Ran 4 tests in 0.055s

FAILED (failures=1)
Destroying test database for alias 'default'...

因为我们之前并没有考虑到image_url的图片扩展名可能会大写。修改ProductForm的相关部分如下:

def clean_image_url(self):
url = self.cleaned_data['image_url']
ifnot endsWith(url.lower(), '.jpg', '.png', '.gif'):
raise forms.ValidationError('图片格式必须为jpg、png或gif')
return url

然后再运行测试:

$ python manage.py test depotapp.ProductTest

Creating test database for alias 'default'...
....
----------------------------------------------------------------------
Ran 4 tests in 0.060s

OK
Destroying test database for alias 'default'...

测试通过,并且通过单元测试,我们发现并解决了一个bug。

 

第21周

  1.  
    函数草稿

您可能感兴趣的文章:

  • 使用Python的Django框架结合jQuery实现AJAX购物车页面
  • Python的Django REST框架中的序列化及请求和返回
  • 详解Python的Django框架中的templates设置
  • Python使用django获取用户IP地址的方法
  • 分析Python的Django框架的运行方式及处理流程
  • Django1.7+python 2.78+pycharm配置mysql数据库教程
  • python常用web框架简单性能测试结果分享(包含django、flask、bottle、tornado)
  • python django集成cas验证系统
  • 教你如何将 Sublime 3 打造成 Python/Django IDE开发利器
  • 详解Python的Django框架中manage命令的使用与扩展

Python中的单元测试 我们先来回顾一下Python中的单元测试方法。 下面是一个
Py…

今日内容概要以及CMDB介绍

前端插件定制之表头

前端插件定制之表内容

第27周

前端插件定制之定制td内容以及属性

CMDB插件示例演示

算法介绍与列表查找

冒泡 选择 插入排序

快排

堆排序

  1.  
       Python之路,Day14 – It’s time for
    Django

  2.  
       Python之路,Day15 –
    Django适当进阶篇

第20周

   jQuery

第12周

       jQuery网址

第9周

  1.    
       Python开发【第十五篇】:Web框架之Tornado

上节回顾

Django之url、Views

Django之Model操作

Django之模版

Django之Session

Django之Session与Cookie

Django之CSRF原理详解

Django之中间件详解

Django之缓存实例详解

Django之信号

Django之Form组件验证

作业

 
 Py西游攻关之装饰器  苑昊老师

第16周

  1.  
      Http协议

  2.        
     Python CMDB开发

上节内容答疑

上节内容回顾

CSS内容补充之position

CSS内容补充之overflow

CSS内容之hover

CSS内容之background

初始javaScript

javascript代码存在形式

javascript基本预览

javascript字符串操作以及跑马灯实例

javascript数组和字典以及for循环

javascript条件语句

javascript函数的定义

Dom直接选择器

Dom间接选择器

示例之模态对话框

示例之全选和反选以及取消

javascript必须加分号

示例之后台管理左侧菜单

今日内容梳理

本周作业

        第五篇:白话tornado源码之褪去模板的外衣

本节题纲

上节内容回顾

ModelForm操作及验证

ajax操作-原生ajax

ajax操作-JQuery的ajax

ajax操作-伪ajax(iframe)

ajax操作-时机选择

文件上传(3种方式)-1

文件上传-时机选择及预览-2

图片验证码

KindEditor基本使用和文件操作

作业

47_1      
 CMDB资产采集

心灵分享

ATM存钱取钱案例剖析

模块定义、导入、优化详解

内置模块详解之time与datetime模块

内置模块详解之Range模块

内置模块详解之OS模块

内置模块详解之Sys模块

内置模块详解之Shelve模块

内置模块详解之Xml模块

内置模块详解之Configparser模块

内置模块详解之Hashlib、Hmac模块

正则表达式Re模块使用详解

第24周

        第二篇:白话tornado源码之待请求阶段

第15周

17_2
   Cpython解释器支持的进程与线程

 

  1.  
    第六篇:python基础之文件处理

  2.   第七篇
    python基础之函数,递归,内置函数

  3.   第八篇
    迭代器协议和生成器

  4.   第九篇
    装饰器

  5. 第十篇
    面向对象的程序设计

  6.   第十一篇
    面向对象进阶

  7.   第十二篇
    异常处理

  8.   第十三篇
    python基础之socket编程

  9.  
    常用模块

  10.  
    模块与包

  11.  
    进程与线程

第7周

今日内容概要

上课内容概要

今日Django工程的创建

Django获取多个数据以及文件上传

Django的CBV和FBV

Django模板语言循环字典

Django基于正则表达式的URL

Django对应的路由名称

Django路由分发

DjangoORM基本创建基本类型以及生成数据库结构

DjangoORM使用mysql注意

DjangoORM基本增删查该

基于ORM实现用户登录

基于ORM实现用户增加删除修改以及查看详细

Django字段类型介绍

DjangoORM字段参数介绍

DjangoORM外键操作

基于DjangoORM的外键实现增加用户(含select标签)

作业

35-4     
 Django之Form组件

上节回顾

Socket实现简单的ssh客户端

Socket实现简单的ssh服务端

积极思考正能量

Socket实现简单的ssh2

Socket粘包

Socket粘包深入编码

SocketServer

SocketServer多并发

多用户在线Ftp程序

  1.  
    常用模块

  2.  
    Py西游攻关之模块

  3.  
     多线程与多进程

  4.  
    Py西游攻关之RabbitMQ、Memcache、Redis

  5.  
    前端基础之html

  6.  
      前端基础之CSS

  7.  
      JavaScript
    基础学习1

  8.  
      前端学习之jquery

本节小鸡汤(电影分享)

面向对象介绍

面向对象特性介绍

实例演示opp编程好处

实例变量与类变量

类变量的作用及析构函数

类的继承

经典类与新式类的继承顺序

继承实例讲解

多态实例讲解

本节作业之选课系统开发

            
 Python之路【第十八篇】:Web框架们

第3周

  1.        python
    之路,Day27 –
    主机管理+堡垒机系统开发

  2.    
      Python之路,Day12 –
    那就做个堡垒机吧

  3.  
      Python之路,Day20 –
    分布式监控系统开发

  4.  
      Python之路,Day19 –
    CMDB、CMDB、CMDB

  5.  
      Python之路,Day18 –
    开发一个WEB聊天来撩妹吧

  6.  
      Python之路,Day17 –
    分分钟做个BBS论坛

今日内容概要

博客系统示例预览

组合搜索组件

JSONP跨域请求jQuery方式

JSONP跨域请求本质

XSS过滤以及单例模式

博客系统表结构讲解

博客系统功能讲解

CMDB介绍

CMDB实现的三种方式

CMDB Agent客户端示例

  1.    
    第一篇:初识Python

  2.  
    第二篇:python基础之核心风格

  3.  
    第三篇:python基础之数据类型与变量

  4.  
    第四篇:python基础之条件和循环

  5. 第五篇:python基础之字符编码

  6. py编码终极版 
    苑昊老师

开课介绍

python发展介绍

第一个python程序

变量

字符编码与二进制

字符编码的区别与介绍

用户交互程序

if else流程判断

while 循环

while 循环优化版本

for 循环及作业要求

相关文章

No Comments, Be The First!
近期评论
    功能
    网站地图xml地图